Reaction Details
TargetFocal adhesion kinase 1
LigandBDBM50243980
Substrate/Competitorn/a
Meas. Tech.ChEMBL_555000 (CHEMBL957975)
IC50 50000±n/a nM
Citation Peifer, CSelig, RKinkel, KOtt, DTotzke, FSchächtele, CHeidenreich, RRöcken, MSchollmeyer, DLaufer, S Design, synthesis, and biological evaluation of novel 3-aryl-4-(1H-indole-3yl)-1,5-dihydro-2H-pyrrole-2-ones as vascular endothelial growth factor receptor (VEGF-R) inhibitors. J Med Chem51:3814-24 (2008) 
 
Focal adhesion kinase 1
Name:Focal adhesion kinase 1
Type:Tyrosine-protein kinase
Mol. Mass.:119233.17
Organism:Homo sapiens (Human)
Description:Q05397
Residue:1052
BDBM50243980
NameBDBM50243980
Synonyms:3-(N-Methyl-1H-indol-3-yl)-4-(3,4,5-trimethoxyphenyl)-1,5-dihydro-2H-pyrrole-2-one | CHEMBL509435
TypeSmall organic molecule
Emp. Form.C22H22N2O4
Mol. Mass.378.4211
SMILESCOc1cc(cc(OC)c1OC)C1=C(C(=O)NC1)c1cn(C)c2ccccc12