Reaction Details
TargetProto-oncogene tyrosine-protein kinase Src
LigandBDBM50243930
Substrate/Competitorn/a
Meas. Tech.ChEMBL_555001 (CHEMBL957976)
IC50 4400±n/a nM
Citation Peifer, CSelig, RKinkel, KOtt, DTotzke, FSchächtele, CHeidenreich, RRöcken, MSchollmeyer, DLaufer, S Design, synthesis, and biological evaluation of novel 3-aryl-4-(1H-indole-3yl)-1,5-dihydro-2H-pyrrole-2-ones as vascular endothelial growth factor receptor (VEGF-R) inhibitors. J Med Chem51:3814-24 (2008) 
 
Proto-oncogene tyrosine-protein kinase Src
Name:Proto-oncogene tyrosine-protein kinase Src
Type:Protein
Mol. Mass.:59838.60
Organism:Homo sapiens (Human)
Description:P12931
Residue:536
BDBM50243930
NameBDBM50243930
Synonyms:4-[1-(tert-Butoxymethyl)-1H-indol-3-yl]-3-(3,4,5-trimethoxyphenyl)-1,5-dihydro-2H-pyrrole-2-one | CHEMBL488646
TypeSmall organic molecule
Emp. Form.C26H30N2O5
Mol. Mass.450.5268
SMILESCOc1cc(cc(OC)c1OC)C1=C(CNC1=O)c1cn(COC(C)(C)C)c2ccccc12