Reaction Details
TargetProto-oncogene tyrosine-protein kinase Src
LigandBDBM50243878
Substrate/Competitorn/a
Meas. Tech.ChEMBL_555001 (CHEMBL957976)
IC50 41000±n/a nM
Citation Peifer, CSelig, RKinkel, KOtt, DTotzke, FSchächtele, CHeidenreich, RRöcken, MSchollmeyer, DLaufer, S Design, synthesis, and biological evaluation of novel 3-aryl-4-(1H-indole-3yl)-1,5-dihydro-2H-pyrrole-2-ones as vascular endothelial growth factor receptor (VEGF-R) inhibitors. J Med Chem51:3814-24 (2008) 
 
Proto-oncogene tyrosine-protein kinase Src
Name:Proto-oncogene tyrosine-protein kinase Src
Type:Protein
Mol. Mass.:59838.60
Organism:Homo sapiens (Human)
Description:P12931
Residue:536
BDBM50243878
NameBDBM50243878
Synonyms:3-(1H-Indol-3-yl)-4-(3,4,5-trimethoxyphenyl)-1,5-dihydro-2Hpyrrole-2-one | CHEMBL521201
TypeSmall organic molecule
Emp. Form.C21H20N2O4
Mol. Mass.364.3945
SMILESCOc1cc(cc(OC)c1OC)C1=C(C(=O)NC1)c1c[nH]c2ccccc12