Reaction Details
TargetSerine/threonine-protein kinase PLK4
LigandBDBM50244032
Substrate/Competitorn/a
Meas. Tech.ChEMBL_555008 (CHEMBL957983)
IC50 46000±n/a nM
Citation Peifer, CSelig, RKinkel, KOtt, DTotzke, FSchächtele, CHeidenreich, RRöcken, MSchollmeyer, DLaufer, S Design, synthesis, and biological evaluation of novel 3-aryl-4-(1H-indole-3yl)-1,5-dihydro-2H-pyrrole-2-ones as vascular endothelial growth factor receptor (VEGF-R) inhibitors. J Med Chem51:3814-24 (2008) 
 
Serine/threonine-protein kinase PLK4
Name:Serine/threonine-protein kinase PLK4
Type:PROTEIN
Mol. Mass.:108996.91
Organism:Homo sapiens (Human)
Description:ChEMBL_1474078
Residue:970
BDBM50244032
NameBDBM50244032
Synonyms:3-(N-Methyl-1H-indol-3-yl)-4-(4-methoxyphenyl)-1,5-dihydro-2H-pyrrole-2-one | CHEMBL507056
TypeSmall organic molecule
Emp. Form.C20H18N2O2
Mol. Mass.318.3691
SMILESCOc1ccc(cc1)C1=C(C(=O)NC1)c1cn(C)c2ccccc12