Reaction Details
TargetVitamin D3 receptor
LigandBDBM50244240
Substrate/Competitorn/a
Meas. Tech.ChEMBL_491881 (CHEMBL946411)
EC50 0.085000±n/a nM
Citation Shimizu, MMiyamoto, YTakaku, HMatsuo, MNakabayashi, MMasuno, HUdagawa, NDeLuca, HFIkura, TIto, N 2-Substituted-16-ene-22-thia-1alpha,25-dihydroxy-26,27-dimethyl-19-norvitamin D3 analogs: Synthesis, biological evaluation, and crystal structure. Bioorg Med Chem16:6949-64 (2008) 
 
Vitamin D3 receptor
Name:Vitamin D3 receptor
Type:PROTEIN
Mol. Mass.:47830.18
Organism:Mus musculus
Description:ChEMBL_491881
Residue:422
BDBM50244240
NameBDBM50244240
Synonyms:(20S)-(2E)-1-alpha-25-Dihydroxy-2-[2-(hydroxy)-ethylidene]-16-ene-22-thia-26,27-dimethyl-19,24-dinorvitamin D3 | CHEMBL472510
TypeSmall organic molecule
Emp. Form.C28H44O4S
Mol. Mass.476.712
SMILESCCC(O)(CC)CS[C@@H](C)C1=CC[C@H]2\C(CCC[C@]12C)=C\C=C1C[C@@H](O)C(=CCO)[C@H](O)C1