Reaction Details
TargetMast/stem cell growth factor receptor Kit
LigandBDBM50243076
Substrate/Competitorn/a
Meas. Tech.ChEMBL_491668 (CHEMBL946386)
IC50 7±n/a nM
Citation Chen, NBürli, RWNeira, SHungate, RZhang, DYu, VNguyen, YTudor, YPlant, MFlynn, SMeagher, KLLee, MRZhang, XItano, ASchrag, MXu, YNg, GYHu, E Discovery of a potent and selective c-Kit inhibitor for the treatment of inflammatory diseases. Bioorg Med Chem Lett18:4137-41 (2008) 
 
Mast/stem cell growth factor receptor Kit
Name:Mast/stem cell growth factor receptor Kit
Type:Protein
Mol. Mass.:109869.37
Organism:Homo sapiens (Human)
Description:P10721
Residue:976
BDBM50243076
NameBDBM50243076
Synonyms:CHEMBL470483 | N3-(6-aminopyridin-3-yl)-4-methyl-N1-(3-(trifluoromethyl)phenyl)isophthalamide
TypeSmall organic molecule
Emp. Form.C21H17F3N4O2
Mol. Mass.414.3805
SMILESCc1ccc(cc1C(=O)Nc1ccc(N)nc1)C(=O)Nc1cccc(c1)C(F)(F)F