Reaction Details
TargetSodium-dependent noradrenaline transporter
LigandBDBM50243010
Substrate/Competitorn/a
Meas. Tech.ChEMBL_487421 (CHEMBL1020015)
Ki 1034±n/a nM
Citation Mahaney, PEGavrin, LKTrybulski, EJStack, GPVu, TACohn, STYe, FBelardi, JKSantilli, AASabatucci, JPLeiter, JJohnston, GHBray, JABurroughs, KDCosmi, SALeventhal, LKoury, EJZhang, YMugford, CAHo, DMRosenzweig-Lipson, SJPlatt, BSmith, VADeecher, DC Structure-activity relationships of the cycloalkanol ethylamine scaffold: discovery of selective norepinephrine reuptake inhibitors. J Med Chem51:4038-49 (2008) 
 
Sodium-dependent noradrenaline transporter
Name:Sodium-dependent noradrenaline transporter
Type:Multi-pass membrane protein
Mol. Mass.:69337.72
Organism:Homo sapiens (Human)
Description:P23975
Residue:617
BDBM50243010
NameBDBM50243010
Synonyms:1-[1-(4-Fluorophenyl)-2-piperazin-1-ylethyl]cyclohexanol Dihydrochloride | CHEMBL445800
TypeSmall organic molecule
Emp. Form.C18H27FN2O
Mol. Mass.306.4182
SMILESOC1(CCCCC1)C(CN1CCNCC1)c1ccc(F)cc1