Reaction Details
TargetSodium-dependent noradrenaline transporter
LigandBDBM50243009
Substrate/Competitorn/a
Meas. Tech.ChEMBL_487421 (CHEMBL1020015)
Ki 1376±n/a nM
Citation Mahaney, PEGavrin, LKTrybulski, EJStack, GPVu, TACohn, STYe, FBelardi, JKSantilli, AASabatucci, JPLeiter, JJohnston, GHBray, JABurroughs, KDCosmi, SALeventhal, LKoury, EJZhang, YMugford, CAHo, DMRosenzweig-Lipson, SJPlatt, BSmith, VADeecher, DC Structure-activity relationships of the cycloalkanol ethylamine scaffold: discovery of selective norepinephrine reuptake inhibitors. J Med Chem51:4038-49 (2008) 
 
Sodium-dependent noradrenaline transporter
Name:Sodium-dependent noradrenaline transporter
Type:Multi-pass membrane protein
Mol. Mass.:69337.72
Organism:Homo sapiens (Human)
Description:P23975
Residue:617
BDBM50243009
NameBDBM50243009
Synonyms:1-[1-(4-Fluorophenyl)-2-(4-methylpiperazin-1-yl)ethyl]cyclohexanol Dihydrocholoride | CHEMBL470078
TypeSmall organic molecule
Emp. Form.C19H29FN2O
Mol. Mass.320.4448
SMILESCN1CCN(CC(c2ccc(F)cc2)C2(O)CCCCC2)CC1