Reaction Details
TargetSodium-dependent dopamine transporter
LigandBDBM50243468
Substrate/Competitorn/a
Meas. Tech.ChEMBL_487432 (CHEMBL1020887)
Ki 53±n/a nM
Citation Mahaney, PEGavrin, LKTrybulski, EJStack, GPVu, TACohn, STYe, FBelardi, JKSantilli, AASabatucci, JPLeiter, JJohnston, GHBray, JABurroughs, KDCosmi, SALeventhal, LKoury, EJZhang, YMugford, CAHo, DMRosenzweig-Lipson, SJPlatt, BSmith, VADeecher, DC Structure-activity relationships of the cycloalkanol ethylamine scaffold: discovery of selective norepinephrine reuptake inhibitors. J Med Chem51:4038-49 (2008) 
 
Sodium-dependent dopamine transporter
Name:Sodium-dependent dopamine transporter
Type:Multi-pass membrane protein
Mol. Mass.:68497.11
Organism:Homo sapiens (Human)
Description:Q01959
Residue:620
BDBM50243468
NameBDBM50243468
Synonyms:1-[1-(3-Chlorophenyl)-2-(4-methylpiperazin-1-yl)ethyl]cyclohexanol Dihydrocholoride | CHEMBL511347
TypeSmall organic molecule
Emp. Form.C19H29ClN2O
Mol. Mass.336.899
SMILESCN1CCN(CC(c2cccc(Cl)c2)C2(O)CCCCC2)CC1