Reaction Details
TargetTransporter
LigandBDBM50010879
Substrate/Competitorn/a
Meas. Tech.ChEMBL_487427 (CHEMBL1020882)
IC50 620±n/a nM
Citation Mahaney, PEGavrin, LKTrybulski, EJStack, GPVu, TACohn, STYe, FBelardi, JKSantilli, AASabatucci, JPLeiter, JJohnston, GHBray, JABurroughs, KDCosmi, SALeventhal, LKoury, EJZhang, YMugford, CAHo, DMRosenzweig-Lipson, SJPlatt, BSmith, VADeecher, DC Structure-activity relationships of the cycloalkanol ethylamine scaffold: discovery of selective norepinephrine reuptake inhibitors. J Med Chem51:4038-49 (2008) 
 
Transporter
Name:Transporter
Type:Multi-pass membrane protein
Mol. Mass.:69236.90
Organism:Rattus norvegicus (rat)
Description:Q63380
Residue:617
BDBM50010879
NameBDBM50010879
Synonyms:1-(2-(dimethylamino)-1-(3-methoxyphenyl)ethyl)cyclohexanol CHEMBL101055
TypeSmall organic molecule
Emp. Form.C17H27NO2
Mol. Mass.277.4018
SMILESCOc1cccc(c1)C(CN(C)C)C1(O)CCCCC1