Reaction Details
TargetCathepsin S
LigandBDBM50252656
Substrate/Competitorn/a
Meas. Tech.ChEMBL_487680 (CHEMBL1009448)
IC50 6±n/a nM
Citation Irie, OEhara, TIwasaki, AYokokawa, FSakaki, JHirao, HKanazawa, TTeno, NHoriuchi, MUmemura, IGunji, HMasuya, KHitomi, YIwasaki, GNonomura, KTanabe, KFukaya, HKosaka, TSnell, CRHallett, A Discovery of selective and nonpeptidic cathepsin S inhibitors. Bioorg Med Chem Lett18:3959-62 (2008) 
 
Cathepsin S
Name:Cathepsin S
Type:Protein
Mol. Mass.:37507.38
Organism:Homo sapiens (Human)
Description:P25774
Residue:331
BDBM50252656
NameBDBM50252656
Synonyms:7-(2-cyclohexylethyl)-6-((pyridin-4-yloxy)methyl)-7H-pyrrolo[2,3-d]pyrimidine-2-carbonitrile | CHEMBL493246
TypeSmall organic molecule
Emp. Form.C21H23N5S
Mol. Mass.377.506
SMILESN#Cc1ncc2cc(CSc3ccncc3)n(CCC3CCCCC3)c2n1