Reaction Details
TargetInsulin-like growth factor 1 receptor
LigandBDBM50252301
Substrate/Competitorn/a
Meas. Tech.ChEMBL_487711 (CHEMBL1022736)
IC50 77±n/a nM
Citation Zimmermann, KWittman, MDSaulnier, MGVelaparthi, ULangley, DRSang, XFrennesson, DCarboni, JLi, AGreer, AGottardis, MAttar, RMYang, ZBalimane, PDiscenza, LNVyas, D Balancing oral exposure with Cyp3A4 inhibition in benzimidazole-based IGF-IR inhibitors. Bioorg Med Chem Lett18:4075-80 (2008) 
 
Insulin-like growth factor 1 receptor
Name:Insulin-like growth factor 1 receptor
Type:PROTEIN
Mol. Mass.:155770.40
Organism:Mus musculus
Description:ChEMBL_820934
Residue:1373
BDBM50252301
NameBDBM50252301
Synonyms:(S)-methyl 4-(1-(2-(4-(2-(3-chlorophenyl)-2-hydroxyethylamino)-2-oxo-1,2-dihydropyridin-3-yl)-4-methyl-1H-benzo[d]imidazol-6-yl)piperidin-4-yl)piperazine-1-carboxylate CHEMBL505919
TypeSmall organic molecule
Emp. Form.C32H38ClN7O4
Mol. Mass.620.142
SMILESCOC(=O)N1CCN(CC1)C1CCN(CC1)c1cc(C)c2nc([nH]c2c1)-c1c(NC[C@@H](O)c2cccc(Cl)c2)cc[nH]c1=O