Reaction Details
TargetInsulin-like growth factor 1 receptor
LigandBDBM50252237
Substrate/Competitorn/a
Meas. Tech.ChEMBL_487711 (CHEMBL1022736)
IC50 39±n/a nM
Citation Zimmermann, KWittman, MDSaulnier, MGVelaparthi, ULangley, DRSang, XFrennesson, DCarboni, JLi, AGreer, AGottardis, MAttar, RMYang, ZBalimane, PDiscenza, LNVyas, D Balancing oral exposure with Cyp3A4 inhibition in benzimidazole-based IGF-IR inhibitors. Bioorg Med Chem Lett18:4075-80 (2008) 
 
Insulin-like growth factor 1 receptor
Name:Insulin-like growth factor 1 receptor
Type:PROTEIN
Mol. Mass.:155770.40
Organism:Mus musculus
Description:ChEMBL_820934
Residue:1373
BDBM50252237
NameBDBM50252237
Synonyms:(S)-methyl 1-(2-(4-(2-(3-chlorophenyl)-2-hydroxyethylamino)-2-oxo-1,2-dihydropyridin-3-yl)-7-methyl-3H-benzo[d]imidazol-5-yl)piperidin-4-ylcarbamate | CHEMBL521271
TypeSmall organic molecule
Emp. Form.C28H31ClN6O4
Mol. Mass.551.037
SMILESCOC(=O)NC1CCN(CC1)c1cc(C)c2nc([nH]c2c1)-c1c(NC[C@@H](O)c2cccc(Cl)c2)cc[nH]c1=O