Reaction Details
TargetCytochrome P450 3A4
LigandBDBM50252295
Substrate/Competitorn/a
Meas. Tech.ChEMBL_487712 (CHEMBL1022737)
IC50 0.5±n/a nM
Citation Zimmermann, KWittman, MDSaulnier, MGVelaparthi, ULangley, DRSang, XFrennesson, DCarboni, JLi, AGreer, AGottardis, MAttar, RMYang, ZBalimane, PDiscenza, LNVyas, D Balancing oral exposure with Cyp3A4 inhibition in benzimidazole-based IGF-IR inhibitors. Bioorg Med Chem Lett18:4075-80 (2008) 
 
Cytochrome P450 3A4
Name:Cytochrome P450 3A4
Type:Enzyme
Mol. Mass.:57349.57
Organism:Homo sapiens (Human)
Description:n/a
Residue:503
BDBM50252295
NameBDBM50252295
Synonyms:3-(6-(4-((1R,4S)-5-oxa-2-aza-bicyclo[2.2.1]heptan-2-yl)piperidin-1-yl)-4-methyl-1H-benzo[d]imidazol-2-yl)-4-((S)-2-(3-chlorophenyl)-2-hydroxyethylamino)pyridin-2(1H)-one | CHEMBL474469
TypeSmall organic molecule
Emp. Form.C31H35ClN6O3
Mol. Mass.575.101
SMILESCc1cc(cc2[nH]c(nc12)-c1c(NC[C@@H](O)c2cccc(Cl)c2)cc[nH]c1=O)N1CCC(CC1)N1C[C@@H]2C[C@@H]1CO2