Reaction Details
TargetCytochrome P450 3A4
LigandBDBM50252294
Substrate/Competitorn/a
Meas. Tech.ChEMBL_487712 (CHEMBL1022737)
IC50 3.1±n/a nM
Citation Zimmermann, KWittman, MDSaulnier, MGVelaparthi, ULangley, DRSang, XFrennesson, DCarboni, JLi, AGreer, AGottardis, MAttar, RMYang, ZBalimane, PDiscenza, LNVyas, D Balancing oral exposure with Cyp3A4 inhibition in benzimidazole-based IGF-IR inhibitors. Bioorg Med Chem Lett18:4075-80 (2008) 
 
Cytochrome P450 3A4
Name:Cytochrome P450 3A4
Type:Enzyme
Mol. Mass.:57349.57
Organism:Homo sapiens (Human)
Description:n/a
Residue:503
BDBM50252294
NameBDBM50252294
Synonyms:4-((S)-2-(3-chlorophenyl)-2-hydroxyethylamino)-3-(6-(4-((2S,6R)-2,6-dimethylmorpholino)piperidin-1-yl)-4-methyl-1H-benzo[d]imidazol-2-yl)pyridin-2(1H)-one | CHEMBL502092
TypeSmall organic molecule
Emp. Form.C32H39ClN6O3
Mol. Mass.591.143
SMILESC[C@H]1CN(C[C@@H](C)O1)C1CCN(CC1)c1cc(C)c2nc([nH]c2c1)-c1c(NC[C@@H](O)c2cccc(Cl)c2)cc[nH]c1=O