Reaction Details
TargetCytochrome P450 3A4
LigandBDBM50252194
Substrate/Competitorn/a
Meas. Tech.ChEMBL_487712 (CHEMBL1022737)
IC50 2.6±n/a nM
Citation Zimmermann, KWittman, MDSaulnier, MGVelaparthi, ULangley, DRSang, XFrennesson, DCarboni, JLi, AGreer, AGottardis, MAttar, RMYang, ZBalimane, PDiscenza, LNVyas, D Balancing oral exposure with Cyp3A4 inhibition in benzimidazole-based IGF-IR inhibitors. Bioorg Med Chem Lett18:4075-80 (2008) 
 
Cytochrome P450 3A4
Name:Cytochrome P450 3A4
Type:Enzyme
Mol. Mass.:57349.57
Organism:Homo sapiens (Human)
Description:n/a
Residue:503
BDBM50252194
NameBDBM50252194
Synonyms:(S)-4-(2-(3-chlorophenyl)-2-hydroxyethylamino)-3-(4-methyl-6-(4-(methylamino)piperidin-1-yl)-1H-benzo[d]imidazol-2-yl)pyridin-2(1H)-one | CHEMBL482102
TypeSmall organic molecule
Emp. Form.C27H31ClN6O2
Mol. Mass.507.027
SMILESCNC1CCN(CC1)c1cc(C)c2nc([nH]c2c1)-c1c(NC[C@@H](O)c2cccc(Cl)c2)cc[nH]c1=O