Reaction Details
TargetEgl nine homolog 1
LigandBDBM50251908
Substrate/Competitorn/a
Meas. Tech.ChEMBL_488018 (CHEMBL983035)
IC50 27±n/a nM
Citation Tegley, CMViswanadhan, VNBiswas, KFrohn, MJPeterkin, TAChang, CBürli, RWDao, JHVeith, HRogers, NYoder, SCBiddlecome, GTagari, PAllen, JRHungate, RW Discovery of novel hydroxy-thiazoles as HIF-alpha prolyl hydroxylase inhibitors: SAR, synthesis, and modeling evaluation. Bioorg Med Chem Lett18:3925-8 (2008) 
 
Egl nine homolog 1
Name:Egl nine homolog 1
Type:Protein
Mol. Mass.:46035.59
Organism:Homo sapiens (Human)
Description:Q9GZT9
Residue:426
BDBM50251908
NameBDBM50251908
Synonyms:2-(3-hydroxy-2-(2-(naphthalen-2-ylsulfonyl)acetamido)-2,3-dihydrothiazol-4-yl)acetic acid | CHEMBL479415
TypeSmall organic molecule
Emp. Form.C17H14N2O6S2
Mol. Mass.406.433
SMILESOC(=O)Cc1csc(=NC(=O)CS(=O)(=O)c2ccc3ccccc3c2)n1O