Reaction Details
TargetEgl nine homolog 1
LigandBDBM50252000
Substrate/Competitorn/a
Meas. Tech.ChEMBL_488018 (CHEMBL983035)
IC50 600±n/a nM
Citation Tegley, CMViswanadhan, VNBiswas, KFrohn, MJPeterkin, TAChang, CBürli, RWDao, JHVeith, HRogers, NYoder, SCBiddlecome, GTagari, PAllen, JRHungate, RW Discovery of novel hydroxy-thiazoles as HIF-alpha prolyl hydroxylase inhibitors: SAR, synthesis, and modeling evaluation. Bioorg Med Chem Lett18:3925-8 (2008) 
 
Egl nine homolog 1
Name:Egl nine homolog 1
Type:Protein
Mol. Mass.:46035.59
Organism:Homo sapiens (Human)
Description:Q9GZT9
Residue:426
BDBM50252000
NameBDBM50252000
Synonyms:2-(3-hydroxy-2-(2-(methylsulfonyl)acetamido)-2,3-dihydrothiazol-4-yl)acetic acid | CHEMBL453519
TypeSmall organic molecule
Emp. Form.C8H10N2O6S2
Mol. Mass.294.305
SMILESCS(=O)(=O)CC(=O)N=c1scc(CC(O)=O)n1O