Reaction Details
TargetEgl nine homolog 1
LigandBDBM50251902
Substrate/Competitorn/a
Meas. Tech.ChEMBL_488018 (CHEMBL983035)
IC50>40000±n/a nM
Citation Tegley, CMViswanadhan, VNBiswas, KFrohn, MJPeterkin, TAChang, CBürli, RWDao, JHVeith, HRogers, NYoder, SCBiddlecome, GTagari, PAllen, JRHungate, RW Discovery of novel hydroxy-thiazoles as HIF-alpha prolyl hydroxylase inhibitors: SAR, synthesis, and modeling evaluation. Bioorg Med Chem Lett18:3925-8 (2008) 
 
Egl nine homolog 1
Name:Egl nine homolog 1
Type:Protein
Mol. Mass.:46035.59
Organism:Homo sapiens (Human)
Description:Q9GZT9
Residue:426
BDBM50251902
NameBDBM50251902
Synonyms:CHEMBL479405 | ethyl 2-(3-hydroxy-2-(2-(phenylsulfonyl)acetamido)-2,3-dihydrothiazol-4-yl)acetate
TypeSmall organic molecule
Emp. Form.C15H16N2O6S2
Mol. Mass.384.427
SMILESCCOC(=O)Cc1csc(=NC(=O)CS(=O)(=O)c2ccccc2)n1O