Reaction Details
TargetAcetylcholinesterase
LigandBDBM50262926
Substrate/Competitorn/a
Meas. Tech.ChEMBL_490564 (CHEMBL981170)
IC50 1±n/a nM
Citation Leonetti, FCatto, MNicolotti, OPisani, LCappa, AStefanachi, ACarotti, A Homo- and hetero-bivalent edrophonium-like ammonium salts as highly potent, dual binding site AChE inhibitors. Bioorg Med Chem16:7450-6 (2008) 
 
Acetylcholinesterase
Name:Acetylcholinesterase
Type:Enzyme
Mol. Mass.:67659.62
Organism:Bos taurus (bovine)
Description:n/a
Residue:613
BDBM50262926
NameBDBM50262926
Synonyms:3-(4-(3,4-dimethyl-2-oxo-2H-chromen-7-yloxy)butoxy)-5-hydroxy-N,N,N-trimethylbenzenaminium iodide | CHEMBL478193
TypeSmall organic molecule
Emp. Form.C24H30NO5
Mol. Mass.412.4982
SMILESCc1c(C)c(=O)oc2cc(OCCCCOc3cc(O)cc(c3)[N+](C)(C)C)ccc12