Reaction Details
TargetAcetylcholinesterase
LigandBDBM50262988
Substrate/Competitorn/a
Meas. Tech.ChEMBL_490564 (CHEMBL981170)
IC50 0.12±n/a nM
Citation Leonetti, FCatto, MNicolotti, OPisani, LCappa, AStefanachi, ACarotti, A Homo- and hetero-bivalent edrophonium-like ammonium salts as highly potent, dual binding site AChE inhibitors. Bioorg Med Chem16:7450-6 (2008) 
 
Acetylcholinesterase
Name:Acetylcholinesterase
Type:Enzyme
Mol. Mass.:67659.62
Organism:Bos taurus (bovine)
Description:n/a
Residue:613
BDBM50262988
NameBDBM50262988
Synonyms:CHEMBL1200541 ambenonium
TypeSmall organic molecule
Emp. Form.C28H42Cl2N4O2
Mol. Mass.537.564
SMILESCC[N+](CC)(CCNC(=O)C(=O)NCC[N+](CC)(CC)Cc1ccccc1Cl)Cc1ccccc1Cl