Reaction Details
TargetLysosomal alpha-mannosidase
LigandBDBM50263091
Substrate/Competitorn/a
Meas. Tech.ChEMBL_489067 (CHEMBL987287)
IC50 75000±n/a nM
Citation Fiaux, HKuntz, DAHoffman, DJanzer, RCGerber-Lemaire, SRose, DRJuillerat-Jeanneret, L Functionalized pyrrolidine inhibitors of human type II alpha-mannosidases as anti-cancer agents: optimizing the fit to the active site. Bioorg Med Chem16:7337-46 (2008) 
 
Lysosomal alpha-mannosidase
Name:Lysosomal alpha-mannosidase
Type:PROTEIN
Mol. Mass.:113753.32
Organism:Homo sapiens (Human)
Description:ChEMBL_1432452
Residue:1011
BDBM50263091
NameBDBM50263091
Synonyms:(R)-2-(((2R,3R,4R)-3,4-dihydroxy-1-methyl-5-oxopyrrolidin-2-yl)methylamino)-2-phenylethyl 4-bromobenzoate | CHEMBL476343
TypeSmall organic molecule
Emp. Form.C21H23BrN2O5
Mol. Mass.463.322
SMILESCN1[C@H](CN[C@@H](COC(=O)c2ccc(Br)cc2)c2ccccc2)[C@@H](O)[C@@H](O)C1=O