Reaction Details
TargetMitogen-activated protein kinase 14
LigandBDBM50263297
Substrate/Competitorn/a
Meas. Tech.ChEMBL_489078 (CHEMBL987298)
Ki 79±n/a nM
Citation Angell, RMAngell, TDBamborough, PBamford, MJChung, CWCockerill, SGFlack, SSJones, KLLaine, DILongstaff, TLudbrook, SPearson, RSmith, KJSmee, PASomers, DOWalker, AL Biphenyl amide p38 kinase inhibitors 4: DFG-in and DFG-out binding modes. Bioorg Med Chem Lett18:4433-7 (2008) 
 
Mitogen-activated protein kinase 14
Name:Mitogen-activated protein kinase 14
Type:Serine/threonine-protein kinase
Mol. Mass.:41286.76
Organism:Homo sapiens (Human)
Description:Q16539
Residue:360
BDBM50263297
NameBDBM50263297
Synonyms:6-Methyl-biphenyl-3,4'-dicarboxylic acid 3-[(3-acetylamino-phenyl)-amide] 4'-[(3-cyano-phenyl)-amide] | CHEMBL476752
TypeSmall organic molecule
Emp. Form.C30H24N4O3
Mol. Mass.488.5366
SMILESCC(=O)Nc1cccc(NC(=O)c2ccc(C)c(c2)-c2ccc(cc2)C(=O)Nc2cccc(c2)C#N)c1