Reaction Details
TargetMitogen-activated protein kinase 14
LigandBDBM50263170
Substrate/Competitorn/a
Meas. Tech.ChEMBL_489078 (CHEMBL987298)
Ki 5.2±n/a nM
Citation Angell, RMAngell, TDBamborough, PBamford, MJChung, CWCockerill, SGFlack, SSJones, KLLaine, DILongstaff, TLudbrook, SPearson, RSmith, KJSmee, PASomers, DOWalker, AL Biphenyl amide p38 kinase inhibitors 4: DFG-in and DFG-out binding modes. Bioorg Med Chem Lett18:4433-7 (2008) 
 
Mitogen-activated protein kinase 14
Name:Mitogen-activated protein kinase 14
Type:Serine/threonine-protein kinase
Mol. Mass.:41286.76
Organism:Homo sapiens (Human)
Description:Q16539
Residue:360
BDBM50263170
NameBDBM50263170
Synonyms:2-Cyclopropylamino-N-[4'-(cyclopropylmethyl-carbamoyl)-6-methyl-biphenyl-3-yl]-isonicotinamide | CHEMBL478656
TypeSmall organic molecule
Emp. Form.C27H28N4O2
Mol. Mass.440.5368
SMILESCc1ccc(NC(=O)c2ccnc(NC3CC3)c2)cc1-c1ccc(cc1)C(=O)NCC1CC1