Reaction Details
TargetHeat shock protein beta-1
LigandBDBM13533
Substrate/Competitorn/a
Meas. Tech.ChEMBL_489080 (CHEMBL987300)
IC50 58±n/a nM
Citation Angell, RMAngell, TDBamborough, PBamford, MJChung, CWCockerill, SGFlack, SSJones, KLLaine, DILongstaff, TLudbrook, SPearson, RSmith, KJSmee, PASomers, DOWalker, AL Biphenyl amide p38 kinase inhibitors 4: DFG-in and DFG-out binding modes. Bioorg Med Chem Lett18:4433-7 (2008) 
 
Heat shock protein beta-1
Name:Heat shock protein beta-1
Type:PROTEIN
Mol. Mass.:22781.73
Organism:Homo sapiens (Human)
Description:ChEMBL_1500622
Residue:205
BDBM13533
NameBDBM13533
Synonyms:1-[2-(4-methylphenyl)-5-tert-butyl-pyrazol-3-yl]-3-[4-(2-morpholin-4-ylethoxy)naphthalen-1-yl]urea 1-[5-tert-butyl-2-(4-methylphenyl)pyrazol-3-yl]-3-[4-(2-morpholin-4-ylethoxy)naphthalen-1-yl]urea 3-[2-(4-methylphenyl)-5-tert-butyl-pyrazol-3-yl]-1-[4-(2-morpholin-4-ylethoxy)naphthalen-1-yl]urea BIRB 796 BIRB-796, 3 D3RKN_73 US11407771, Compound 43 US9187470, 43 (BIRB-796) US9260410, BIRB796 diaryl urea compound 10
TypeSmall organic molecule
Emp. Form.C31H37N5O3
Mol. Mass.527.6572
SMILESCc1ccc(cc1)-n1nc(cc1NC(=O)Nc1ccc(OCCN2CCOCC2)c2ccccc12)C(C)(C)C