Reaction Details
TargetCholinesterase
LigandBDBM50263262
Substrate/Competitorn/a
Meas. Tech.ChEMBL_489451 (CHEMBL982933)
IC50 137±n/a nM
Citation Rosini, MSimoni, EBartolini, MCavalli, ACeccarini, LPascu, NMcClymont, DWTarozzi, ABolognesi, MLMinarini, ATumiatti, VAndrisano, VMellor, IRMelchiorre, C Inhibition of acetylcholinesterase, beta-amyloid aggregation, and NMDA receptors in Alzheimer's disease: a promising direction for the multi-target-directed ligands gold rush. J Med Chem51:4381-4 (2008) 
 
Cholinesterase
Name:Cholinesterase
Type:Homotetramer
Mol. Mass.:68422.27
Organism:Homo sapiens (Human)
Description:P06276
Residue:602
BDBM50263262
NameBDBM50263262
Synonyms:CHEMBL474268 | N-[6-(9H-Carbazol-4-yloxy)hexyl]-N'-(6-chloro-1,2,3,4-tetrahydroacridin-9-yl)propane-1,3-diamine
TypeSmall organic molecule
Emp. Form.C34H39ClN4O
Mol. Mass.555.153
SMILESClc1ccc2c(NCCCNCCCCCCOc3cccc4[nH]c5ccccc5c34)c3CCCCc3nc2c1