Reaction Details
TargetMitogen-activated protein kinase 14
LigandBDBM25981
Substrate/Competitorn/a
Meas. Tech.ChEMBL_490152 (CHEMBL983811)
Ki 480±n/a nM
Citation Angell, RAston, NMBamborough, PBuckton, JBCockerill, SdeBoeck, SJEdwards, CDHolmes, DSJones, KLLaine, DIPatel, SSmee, PASmith, KJSomers, DOWalker, AL Biphenyl amide p38 kinase inhibitors 3: Improvement of cellular and in vivo activity. Bioorg Med Chem Lett18:4428-32 (2008) 
 
Mitogen-activated protein kinase 14
Name:Mitogen-activated protein kinase 14
Type:Serine/threonine-protein kinase
Mol. Mass.:41286.76
Organism:Homo sapiens (Human)
Description:Q16539
Residue:360
BDBM25981
NameBDBM25981
Synonyms:BMCL18324 Compound 17 D3RKN_78 biphenyl amide, 4
TypeSmall organic molecule
Emp. Form.C21H21N3O2
Mol. Mass.347.4103
SMILESCc1nnc(o1)-c1ccc(C)c(c1)-c1ccc(cc1)C(=O)NCC1CC1