Reaction Details
TargetMitogen-activated protein kinase 14
LigandBDBM50263025
Substrate/Competitorn/a
Meas. Tech.ChEMBL_490152 (CHEMBL983811)
Ki 940±n/a nM
Citation Angell, RAston, NMBamborough, PBuckton, JBCockerill, SdeBoeck, SJEdwards, CDHolmes, DSJones, KLLaine, DIPatel, SSmee, PASmith, KJSomers, DOWalker, AL Biphenyl amide p38 kinase inhibitors 3: Improvement of cellular and in vivo activity. Bioorg Med Chem Lett18:4428-32 (2008) 
 
Mitogen-activated protein kinase 14
Name:Mitogen-activated protein kinase 14
Type:Serine/threonine-protein kinase
Mol. Mass.:41286.76
Organism:Homo sapiens (Human)
Description:Q16539
Residue:360
BDBM50263025
NameBDBM50263025
Synonyms:CHEMBL516287 | Furan-3-carboxylic acid [4'-(cyclopropylmethyl-carbamoyl)-biphenyl-3-yl]-amide
TypeSmall organic molecule
Emp. Form.C22H20N2O3
Mol. Mass.360.4058
SMILESO=C(Nc1cccc(c1)-c1ccc(cc1)C(=O)NCC1CC1)c1ccoc1