Reaction Details
TargetMitogen-activated protein kinase 14
LigandBDBM50263024
Substrate/Competitorn/a
Meas. Tech.ChEMBL_490152 (CHEMBL983811)
Ki 460±n/a nM
Citation Angell, RAston, NMBamborough, PBuckton, JBCockerill, SdeBoeck, SJEdwards, CDHolmes, DSJones, KLLaine, DIPatel, SSmee, PASmith, KJSomers, DOWalker, AL Biphenyl amide p38 kinase inhibitors 3: Improvement of cellular and in vivo activity. Bioorg Med Chem Lett18:4428-32 (2008) 
 
Mitogen-activated protein kinase 14
Name:Mitogen-activated protein kinase 14
Type:Serine/threonine-protein kinase
Mol. Mass.:41286.76
Organism:Homo sapiens (Human)
Description:Q16539
Residue:360
BDBM50263024
NameBDBM50263024
Synonyms:6-Fluoro-biphenyl-3,4'-dicarboxylic acid 3-cyclopropylamide 4'-cyclopropylmethyl-amide | CHEMBL479245
TypeSmall organic molecule
Emp. Form.C21H21FN2O2
Mol. Mass.352.402
SMILESFc1ccc(cc1-c1ccc(cc1)C(=O)NCC1CC1)C(=O)NC1CC1