Reaction Details
TargetMitogen-activated protein kinase 14
LigandBDBM50262978
Substrate/Competitorn/a
Meas. Tech.ChEMBL_490152 (CHEMBL983811)
Ki 370±n/a nM
Citation Angell, RAston, NMBamborough, PBuckton, JBCockerill, SdeBoeck, SJEdwards, CDHolmes, DSJones, KLLaine, DIPatel, SSmee, PASmith, KJSomers, DOWalker, AL Biphenyl amide p38 kinase inhibitors 3: Improvement of cellular and in vivo activity. Bioorg Med Chem Lett18:4428-32 (2008) 
 
Mitogen-activated protein kinase 14
Name:Mitogen-activated protein kinase 14
Type:Serine/threonine-protein kinase
Mol. Mass.:41286.76
Organism:Homo sapiens (Human)
Description:Q16539
Residue:360
BDBM50262978
NameBDBM50262978
Synonyms:6-Methyl-biphenyl-3,4'-dicarboxylic acid 3-cyclopropylamide 4'-[(3-dimethylamino-propyl)-amide] | CHEMBL477558
TypeSmall organic molecule
Emp. Form.C23H29N3O2
Mol. Mass.379.4953
SMILESCN(C)CCCNC(=O)c1ccc(cc1)-c1cc(ccc1C)C(=O)NC1CC1