Reaction Details
TargetMitogen-activated protein kinase 14
LigandBDBM50262820
Substrate/Competitorn/a
Meas. Tech.ChEMBL_490152 (CHEMBL983811)
Ki 1100±n/a nM
Citation Angell, RAston, NMBamborough, PBuckton, JBCockerill, SdeBoeck, SJEdwards, CDHolmes, DSJones, KLLaine, DIPatel, SSmee, PASmith, KJSomers, DOWalker, AL Biphenyl amide p38 kinase inhibitors 3: Improvement of cellular and in vivo activity. Bioorg Med Chem Lett18:4428-32 (2008) 
 
Mitogen-activated protein kinase 14
Name:Mitogen-activated protein kinase 14
Type:Serine/threonine-protein kinase
Mol. Mass.:41286.76
Organism:Homo sapiens (Human)
Description:Q16539
Residue:360
BDBM50262820
NameBDBM50262820
Synonyms:5'-(Cyclopentanecarbonyl-amino)-2'-methyl-biphenyl-4-carboxylic acid cyclopropylmethyl-amide | CHEMBL479258
TypeSmall organic molecule
Emp. Form.C24H28N2O2
Mol. Mass.376.4913
SMILESCc1ccc(NC(=O)C2CCCC2)cc1-c1ccc(cc1)C(=O)NCC1CC1