Reaction Details
TargetMitogen-activated protein kinase 14
LigandBDBM50262783
Substrate/Competitorn/a
Meas. Tech.ChEMBL_490152 (CHEMBL983811)
Ki 270±n/a nM
Citation Angell, RAston, NMBamborough, PBuckton, JBCockerill, SdeBoeck, SJEdwards, CDHolmes, DSJones, KLLaine, DIPatel, SSmee, PASmith, KJSomers, DOWalker, AL Biphenyl amide p38 kinase inhibitors 3: Improvement of cellular and in vivo activity. Bioorg Med Chem Lett18:4428-32 (2008) 
 
Mitogen-activated protein kinase 14
Name:Mitogen-activated protein kinase 14
Type:Serine/threonine-protein kinase
Mol. Mass.:41286.76
Organism:Homo sapiens (Human)
Description:Q16539
Residue:360
BDBM50262783
NameBDBM50262783
Synonyms:5'-(Cyclobutanecarbonyl-amino)-2'-methyl-biphenyl-4-carboxylic acid cyclopropylmethyl-amide TCMDC-138709
TypeSmall organic molecule
Emp. Form.C23H26N2O2
Mol. Mass.362.4647
SMILESCc1ccc(NC(=O)C2CCC2)cc1-c1ccc(cc1)C(=O)NCC1CC1