Reaction Details
TargetMitogen-activated protein kinase 14
LigandBDBM50263308
Substrate/Competitorn/a
Meas. Tech.ChEMBL_490152 (CHEMBL983811)
Ki 100±n/a nM
Citation Angell, RAston, NMBamborough, PBuckton, JBCockerill, SdeBoeck, SJEdwards, CDHolmes, DSJones, KLLaine, DIPatel, SSmee, PASmith, KJSomers, DOWalker, AL Biphenyl amide p38 kinase inhibitors 3: Improvement of cellular and in vivo activity. Bioorg Med Chem Lett18:4428-32 (2008) 
 
Mitogen-activated protein kinase 14
Name:Mitogen-activated protein kinase 14
Type:Serine/threonine-protein kinase
Mol. Mass.:41286.76
Organism:Homo sapiens (Human)
Description:Q16539
Residue:360
BDBM50263308
NameBDBM50263308
Synonyms:6-Methyl-biphenyl-3,4'-dicarboxylic acid 4'-cyclopropylmethyl-amide 3-ethylamide | CHEMBL476768
TypeSmall organic molecule
Emp. Form.C21H24N2O2
Mol. Mass.336.4275
SMILESCCNC(=O)c1ccc(C)c(c1)-c1ccc(cc1)C(=O)NCC1CC1