Reaction Details
TargetMitogen-activated protein kinase 11
LigandBDBM50263093
Substrate/Competitorn/a
Meas. Tech.ChEMBL_490153 (CHEMBL983812)
Ki 24±n/a nM
Citation Angell, RAston, NMBamborough, PBuckton, JBCockerill, SdeBoeck, SJEdwards, CDHolmes, DSJones, KLLaine, DIPatel, SSmee, PASmith, KJSomers, DOWalker, AL Biphenyl amide p38 kinase inhibitors 3: Improvement of cellular and in vivo activity. Bioorg Med Chem Lett18:4428-32 (2008) 
 
Mitogen-activated protein kinase 11
Name:Mitogen-activated protein kinase 11
Type:Enzyme Catalytic Domain
Mol. Mass.:41351.73
Organism:Homo sapiens (Human)
Description:gi_20128774
Residue:364
BDBM50263093
NameBDBM50263093
Synonyms:6-Methyl-biphenyl-3,4'-dicarboxylic acid 3-cyclopropylamide 4'-cyclopropylmethyl-amide N3-cyclopropyl-N4'-(cyclopropylmethyl)-6-methylbiphenyl-3,4'-dicarboxamide | N~3~-cyclopropyl-N~4~'-(cyclopropylmethyl)-6-methylbiphenyl-3,4'-dicarboxamide
TypeSmall organic molecule
Emp. Form.C22H24N2O2
Mol. Mass.348.4382
SMILESCc1ccc(cc1-c1ccc(cc1)C(=O)NCC1CC1)C(=O)NC1CC1