Reaction Details
TargetBone morphogenetic protein 4
LigandBDBM50261871
Substrate/Competitorn/a
Meas. Tech.ChEMBL_490878 (CHEMBL989154)
IC50 450±n/a nM
Citation Cuny, GDYu, PBLaha, JKXing, XLiu, JFLai, CSDeng, DYSachidanandan, CBloch, KDPeterson, RT Structure-activity relationship study of bone morphogenetic protein (BMP) signaling inhibitors. Bioorg Med Chem Lett18:4388-92 (2008) 
 
Bone morphogenetic protein 4
Name:Bone morphogenetic protein 4
Type:PROTEIN
Mol. Mass.:46572.96
Organism:Homo sapiens (Human)
Description:ChEMBL_1363193
Residue:408
BDBM50261871
NameBDBM50261871
Synonyms:6-(4-(2-(4-methylpiperazin-1-yl)ethoxy)phenyl)-3-(pyridin-4-yl)pyrazolo[1,5-a]pyrimidine | CHEMBL466765
TypeSmall organic molecule
Emp. Form.C24H26N6O
Mol. Mass.414.5028
SMILESCN1CCN(CCOc2ccc(cc2)-c2cnc3c(cnn3c2)-c2ccncc2)CC1