Reaction Details
TargetBone morphogenetic protein 4
LigandBDBM50262685
Substrate/Competitorn/a
Meas. Tech.ChEMBL_490878 (CHEMBL989154)
IC50 430±n/a nM
Citation Cuny, GDYu, PBLaha, JKXing, XLiu, JFLai, CSDeng, DYSachidanandan, CBloch, KDPeterson, RT Structure-activity relationship study of bone morphogenetic protein (BMP) signaling inhibitors. Bioorg Med Chem Lett18:4388-92 (2008) 
 
Bone morphogenetic protein 4
Name:Bone morphogenetic protein 4
Type:PROTEIN
Mol. Mass.:46572.96
Organism:Homo sapiens (Human)
Description:ChEMBL_1363193
Residue:408
BDBM50262685
NameBDBM50262685
Synonyms:6-(4-(2-(piperidin-1-yl)ethoxy)phenyl)-3-(pyridin-4-yl)pyrazolo[1,5-a]pyrimidine CHEMBL478629 US9040694, Dorsomorphin
TypeSmall organic molecule
Emp. Form.C24H25N5O
Mol. Mass.399.4882
SMILESC(CN1CCCCC1)Oc1ccc(cc1)-c1cnc2c(cnn2c1)-c1ccncc1