Reaction Details
TargetCannabinoid receptor 1
LigandBDBM50261907
Substrate/Competitorn/a
Meas. Tech.ChEMBL_514025 (CHEMBL976340)
EC50 951±n/a nM
Citation DiMauro, EFBuchanan, JLCheng, AEmkey, RHitchcock, SAHuang, LHuang, MYJanosky, BLee, JHLi, XMartin, MWTomlinson, SAWhite, RDZheng, XMPatel, VFFremeau, RT Structural modifications of N-arylamide oxadiazoles: Identification of N-arylpiperidine oxadiazoles as potent and selective agonists of CB2. Bioorg Med Chem Lett18:4267-74 (2008) 
 
Cannabinoid receptor 1
Name:Cannabinoid receptor 1
Type:G Protein-Coupled Receptor (GPCR)
Mol. Mass.:52868.96
Organism:Homo sapiens (Human)
Description:P21554
Residue:472
BDBM50261907
NameBDBM50261907
Synonyms:3-(4-(3-(2,4-dichlorophenyl)-1,2,4-oxadiazol-5-yl)piperidin-1-yl)quinoline | CHEMBL467392
TypeSmall organic molecule
Emp. Form.C22H18Cl2N4O
Mol. Mass.425.311
SMILESClc1ccc(-c2noc(n2)C2CCN(CC2)c2cnc3ccccc3c2)c(Cl)c1