Reaction Details
TargetCannabinoid receptor 1
LigandBDBM50262392
Substrate/Competitorn/a
Meas. Tech.ChEMBL_514025 (CHEMBL976340)
EC50 403±n/a nM
Citation DiMauro, EFBuchanan, JLCheng, AEmkey, RHitchcock, SAHuang, LHuang, MYJanosky, BLee, JHLi, XMartin, MWTomlinson, SAWhite, RDZheng, XMPatel, VFFremeau, RT Structural modifications of N-arylamide oxadiazoles: Identification of N-arylpiperidine oxadiazoles as potent and selective agonists of CB2. Bioorg Med Chem Lett18:4267-74 (2008) 
 
Cannabinoid receptor 1
Name:Cannabinoid receptor 1
Type:G Protein-Coupled Receptor (GPCR)
Mol. Mass.:52868.96
Organism:Homo sapiens (Human)
Description:P21554
Residue:472
BDBM50262392
NameBDBM50262392
Synonyms:3-(3-(2-chloro-4-fluorophenyl)-1,2,4-oxadiazol-5-yl)-N-(quinolin-3-yl)propanamide | CHEMBL476100
TypeSmall organic molecule
Emp. Form.C20H14ClFN4O2
Mol. Mass.396.802
SMILESFc1ccc(-c2noc(CCC(=O)Nc3cnc4ccccc4c3)n2)c(Cl)c1