Reaction Details
TargetCannabinoid receptor 1
LigandBDBM50262505
Substrate/Competitorn/a
Meas. Tech.ChEMBL_514032 (CHEMBL976347)
EC50>2000±n/a nM
Citation DiMauro, EFBuchanan, JLCheng, AEmkey, RHitchcock, SAHuang, LHuang, MYJanosky, BLee, JHLi, XMartin, MWTomlinson, SAWhite, RDZheng, XMPatel, VFFremeau, RT Structural modifications of N-arylamide oxadiazoles: Identification of N-arylpiperidine oxadiazoles as potent and selective agonists of CB2. Bioorg Med Chem Lett18:4267-74 (2008) 
 
Cannabinoid receptor 1
Name:Cannabinoid receptor 1
Type:G Protein-Coupled Receptor (GPCR)
Mol. Mass.:52868.96
Organism:Homo sapiens (Human)
Description:P21554
Residue:472
BDBM50262505
NameBDBM50262505
Synonyms:(+/-)-N-(((1S,2S)-2-(3-(2-chloro-4-fluorophenyl)-1,2,4-oxadiazol-5-yl)cyclopropyl)methyl)quinolin-3-amine | CHEMBL476110
TypeSmall organic molecule
Emp. Form.C21H16ClFN4O
Mol. Mass.394.829
SMILESFc1ccc(-c2noc(n2)[C@H]2C[C@@H]2CNc2cnc3ccccc3c2)c(Cl)c1