Reaction Details
TargetCannabinoid receptor 2
LigandBDBM50261909
Substrate/Competitorn/a
Meas. Tech.ChEMBL_514022 (CHEMBL976337)
EC50 26±n/a nM
Citation DiMauro, EFBuchanan, JLCheng, AEmkey, RHitchcock, SAHuang, LHuang, MYJanosky, BLee, JHLi, XMartin, MWTomlinson, SAWhite, RDZheng, XMPatel, VFFremeau, RT Structural modifications of N-arylamide oxadiazoles: Identification of N-arylpiperidine oxadiazoles as potent and selective agonists of CB2. Bioorg Med Chem Lett18:4267-74 (2008) 
 
Cannabinoid receptor 2
Name:Cannabinoid receptor 2
Type:G Protein-Coupled Receptor (GPCR)
Mol. Mass.:39690.94
Organism:Homo sapiens (Human)
Description:P34972
Residue:360
BDBM50261909
NameBDBM50261909
Synonyms:3-(4-(3-cyclohexyl-1,2,4-oxadiazol-5-yl)piperidin-1-yl)quinoline | CHEMBL469006
TypeSmall organic molecule
Emp. Form.C22H26N4O
Mol. Mass.362.468
SMILESC1CCC(CC1)c1noc(n1)C1CCN(CC1)c1cnc2ccccc2c1