Reaction Details
TargetCannabinoid receptor 2
LigandBDBM50262447
Substrate/Competitorn/a
Meas. Tech.ChEMBL_514022 (CHEMBL976337)
EC50 11±n/a nM
Citation DiMauro, EFBuchanan, JLCheng, AEmkey, RHitchcock, SAHuang, LHuang, MYJanosky, BLee, JHLi, XMartin, MWTomlinson, SAWhite, RDZheng, XMPatel, VFFremeau, RT Structural modifications of N-arylamide oxadiazoles: Identification of N-arylpiperidine oxadiazoles as potent and selective agonists of CB2. Bioorg Med Chem Lett18:4267-74 (2008) 
 
Cannabinoid receptor 2
Name:Cannabinoid receptor 2
Type:G Protein-Coupled Receptor (GPCR)
Mol. Mass.:39690.94
Organism:Homo sapiens (Human)
Description:P34972
Residue:360
BDBM50262447
NameBDBM50262447
Synonyms:CHEMBL477993 | N-(3-(3-(2-chloro-4-fluorophenyl)-1,2,4-oxadiazol-5-yl)propyl)quinolin-3-amine
TypeSmall organic molecule
Emp. Form.C20H16ClFN4O
Mol. Mass.382.819
SMILESFc1ccc(-c2noc(CCCNc3cnc4ccccc4c3)n2)c(Cl)c1