Reaction Details
TargetSubstance-P receptor
LigandBDBM50067935
Substrate/Competitorn/a
Meas. Tech.ChEMBL_514327 (CHEMBL967145)
IC50 0.4±n/a nM
Citation Shishido, YWakabayashi, HKoike, HUeno, NNukui, SYamagishi, TMurata, YNaganeo, FMizutani, MShimada, KFujiwara, YSakakibara, ASuga, OKusano, RUeda, SKanai, YTsuchiya, MSatake, K Discovery and stereoselective synthesis of the novel isochroman neurokinin-1 receptor antagonist 'CJ-17,493'. Bioorg Med Chem16:7193-205 (2008) 
 
Substance-P receptor
Name:Substance-P receptor
Type:G Protein-Coupled Receptor (GPCR)
Mol. Mass.:46254.43
Organism:Homo sapiens (Human)
Description:P25103
Residue:407
BDBM50067935
NameBDBM50067935
Synonyms:(2-Methoxy-5-trifluoromethoxy-benzyl)-((2S,3S)-2-phenyl-piperidin-3-yl)-amine CHEMBL319118 | CP-122721
TypeSmall organic molecule
Emp. Form.C20H23F3N2O2
Mol. Mass.380.404
SMILESCOc1ccc(OC(F)(F)F)cc1CN[C@H]1CCCN[C@H]1c1ccccc1