Reaction Details
TargetSubstance-P receptor
LigandBDBM50262510
Substrate/Competitorn/a
Meas. Tech.ChEMBL_514327 (CHEMBL967145)
IC50 0.340±n/a nM
Citation Shishido, YWakabayashi, HKoike, HUeno, NNukui, SYamagishi, TMurata, YNaganeo, FMizutani, MShimada, KFujiwara, YSakakibara, ASuga, OKusano, RUeda, SKanai, YTsuchiya, MSatake, K Discovery and stereoselective synthesis of the novel isochroman neurokinin-1 receptor antagonist 'CJ-17,493'. Bioorg Med Chem16:7193-205 (2008) 
 
Substance-P receptor
Name:Substance-P receptor
Type:G Protein-Coupled Receptor (GPCR)
Mol. Mass.:46254.43
Organism:Homo sapiens (Human)
Description:P25103
Residue:407
BDBM50262510
NameBDBM50262510
Synonyms:CHEMBL477365 R/S-(2S,3S)-N-((3-methoxy-8-methyl-8-(trifluoromethyl)-5,6,7,8-tetrahydronaphthalen-2-yl)methyl)-2-phenylpiperidin-3-amine
TypeSmall organic molecule
Emp. Form.C25H31F3N2O
Mol. Mass.432.5216
SMILESCOc1cc2CCCC(C)(c2cc1CN[C@H]1CCCN[C@H]1c1ccccc1)C(F)(F)F