Reaction Details
TargetCytochrome P450 2D6
LigandBDBM50262281
Substrate/Competitorn/a
Meas. Tech.ChEMBL_514340 (CHEMBL967954)
Ki 4250±n/a nM
Citation Shishido, YWakabayashi, HKoike, HUeno, NNukui, SYamagishi, TMurata, YNaganeo, FMizutani, MShimada, KFujiwara, YSakakibara, ASuga, OKusano, RUeda, SKanai, YTsuchiya, MSatake, K Discovery and stereoselective synthesis of the novel isochroman neurokinin-1 receptor antagonist 'CJ-17,493'. Bioorg Med Chem16:7193-205 (2008) 
 
Cytochrome P450 2D6
Name:Cytochrome P450 2D6
Type:Protein
Mol. Mass.:55774.82
Organism:Homo sapiens (Human)
Description:P10635
Residue:497
BDBM50262281
NameBDBM50262281
Synonyms:(2S,3S)-3-[2-Methoxy-5-(2,2,2-trifluoroethyl)benzylamino]-2-phenylpiperidine | CHEMBL469176
TypeSmall organic molecule
Emp. Form.C21H25F3N2O
Mol. Mass.378.4312
SMILESCOc1ccc(CC(F)(F)F)cc1CN[C@H]1CCCN[C@H]1c1ccccc1