Reaction Details
TargetCytochrome P450 2D6
LigandBDBM50262395
Substrate/Competitorn/a
Meas. Tech.ChEMBL_514340 (CHEMBL967954)
Ki 20±n/a nM
Citation Shishido, YWakabayashi, HKoike, HUeno, NNukui, SYamagishi, TMurata, YNaganeo, FMizutani, MShimada, KFujiwara, YSakakibara, ASuga, OKusano, RUeda, SKanai, YTsuchiya, MSatake, K Discovery and stereoselective synthesis of the novel isochroman neurokinin-1 receptor antagonist 'CJ-17,493'. Bioorg Med Chem16:7193-205 (2008) 
 
Cytochrome P450 2D6
Name:Cytochrome P450 2D6
Type:Protein
Mol. Mass.:55774.82
Organism:Homo sapiens (Human)
Description:P10635
Residue:497
BDBM50262395
NameBDBM50262395
Synonyms:CHEMBL478620 | R/S-(2S,3S)-N-((6-methoxy-3-(trifluoromethyl)-2,3-dihydro-1H-inden-5-yl)methyl)-2-phenylpiperidin-3-amine
TypeSmall organic molecule
Emp. Form.C23H27F3N2O
Mol. Mass.404.4685
SMILESCOc1cc2CCC(c2cc1CN[C@H]1CCCN[C@H]1c1ccccc1)C(F)(F)F