Reaction Details
TargetCytochrome P450 2D6
LigandBDBM50262567
Substrate/Competitorn/a
Meas. Tech.ChEMBL_514340 (CHEMBL967954)
Ki 420±n/a nM
Citation Shishido, YWakabayashi, HKoike, HUeno, NNukui, SYamagishi, TMurata, YNaganeo, FMizutani, MShimada, KFujiwara, YSakakibara, ASuga, OKusano, RUeda, SKanai, YTsuchiya, MSatake, K Discovery and stereoselective synthesis of the novel isochroman neurokinin-1 receptor antagonist 'CJ-17,493'. Bioorg Med Chem16:7193-205 (2008) 
 
Cytochrome P450 2D6
Name:Cytochrome P450 2D6
Type:Protein
Mol. Mass.:55774.82
Organism:Homo sapiens (Human)
Description:P10635
Residue:497
BDBM50262567
NameBDBM50262567
Synonyms:((2S,3S)-2-Benzhydryl-1-aza-bicyclo[2.2.2]oct-3-yl)-(5-isopropyl-2-methoxy-benzyl)-amine EZLOPITANT
TypeSmall organic molecule
Emp. Form.C31H38N2O
Mol. Mass.454.6462
SMILESCOc1ccc(cc1CN[C@H]1C2CCN(CC2)[C@H]1C(c1ccccc1)c1ccccc1)C(C)C