Reaction Details
TargetHistone deacetylase 2
LigandBDBM50268121
Substrate/Competitorn/a
Meas. Tech.ChEMBL_521104 (CHEMBL960365)
IC50 3±n/a nM
Citation Andrianov, VGailite, VLola, DLoza, ESemenikhina, VKalvinsh, IFinn, PPetersen, KDRitchie, JWKhan, NTumber, ACollins, LSVadlamudi, SMBjörkling, FSehested, M Novel amide derivatives as inhibitors of histone deacetylase: design, synthesis and SAR. Eur J Med Chem44:1067-85 (2009) 
 
Histone deacetylase 2
Name:Histone deacetylase 2
Type:Chromatin regulator; hydrolase; repressor
Mol. Mass.:55356.54
Organism:Homo sapiens (Human)
Description:Q92769
Residue:488
BDBM50268121
NameBDBM50268121
Synonyms:(E)-3-(4-Chloro-2-fluorophenyl)-N-[6-(hydroxyamino)-6-oxohexyl]-2-propenamide | CHEMBL484489
TypeSmall organic molecule
Emp. Form.C15H18ClFN2O3
Mol. Mass.328.766
SMILESONC(=O)CCCCCNC(=O)\C=C\c1ccc(Cl)cc1F