Reaction Details
TargetHistone deacetylase 6
LigandBDBM50268121
Substrate/Competitorn/a
Meas. Tech.ChEMBL_521108 (CHEMBL960369)
IC50 2.5±n/a nM
Citation Andrianov, VGailite, VLola, DLoza, ESemenikhina, VKalvinsh, IFinn, PPetersen, KDRitchie, JWKhan, NTumber, ACollins, LSVadlamudi, SMBjörkling, FSehested, M Novel amide derivatives as inhibitors of histone deacetylase: design, synthesis and SAR. Eur J Med Chem44:1067-85 (2009) 
 
Histone deacetylase 6
Name:Histone deacetylase 6
Type:Chromatin regulator; hydrolase; repressor
Mol. Mass.:131381.51
Organism:Homo sapiens (Human)
Description:Q9UBN7
Residue:1215
BDBM50268121
NameBDBM50268121
Synonyms:(E)-3-(4-Chloro-2-fluorophenyl)-N-[6-(hydroxyamino)-6-oxohexyl]-2-propenamide | CHEMBL484489
TypeSmall organic molecule
Emp. Form.C15H18ClFN2O3
Mol. Mass.328.766
SMILESONC(=O)CCCCCNC(=O)\C=C\c1ccc(Cl)cc1F