Reaction Details
TargetLeukotriene A-4 hydrolase
LigandBDBM50272200
Substrate/Competitorn/a
Meas. Tech.ChEMBL_510221 (CHEMBL1004837)
IC50 120±n/a nM
Citation Enomoto, HMorikawa, YMiyake, YTsuji, FMizuchi, MSuhara, HFujimura, KHoriuchi, MBan, M Synthesis and biological evaluation of N-mercaptoacylproline and N-mercaptoacylthiazolidine-4-carboxylic acid derivatives as leukotriene A4 hydrolase inhibitors. Bioorg Med Chem Lett18:4529-32 (2008) 
 
Leukotriene A-4 hydrolase
Name:Leukotriene A-4 hydrolase
Type:PROTEIN
Mol. Mass.:68972.78
Organism:Cavia porcellus
Description:ChEMBL_544515
Residue:611
BDBM50272200
NameBDBM50272200
Synonyms:(2S,5S)-5-(4-(methylthio)benzylthio)-1-((S)-3-mercapto-2-methylpropanoyl)pyrrolidine-2-carboxylic acid | CHEMBL525967
TypeSmall organic molecule
Emp. Form.C17H23NO3S3
Mol. Mass.385.564
SMILESCSc1ccc(CS[C@H]2CC[C@H](N2C(=O)[C@H](C)CS)C(O)=O)cc1