Reaction Details
TargetLeukotriene A-4 hydrolase
LigandBDBM50272143
Substrate/Competitorn/a
Meas. Tech.ChEMBL_510221 (CHEMBL1004837)
IC50 790±n/a nM
Citation Enomoto, HMorikawa, YMiyake, YTsuji, FMizuchi, MSuhara, HFujimura, KHoriuchi, MBan, M Synthesis and biological evaluation of N-mercaptoacylproline and N-mercaptoacylthiazolidine-4-carboxylic acid derivatives as leukotriene A4 hydrolase inhibitors. Bioorg Med Chem Lett18:4529-32 (2008) 
 
Leukotriene A-4 hydrolase
Name:Leukotriene A-4 hydrolase
Type:PROTEIN
Mol. Mass.:68972.78
Organism:Cavia porcellus
Description:ChEMBL_544515
Residue:611
BDBM50272143
NameBDBM50272143
Synonyms:(2S,5S)-5-(4-isopropylphenethylthio)-1-((S)-3-mercapto-2-methylpropanoyl)pyrrolidine-2-carboxylic acid | CHEMBL525948
TypeSmall organic molecule
Emp. Form.C20H29NO3S2
Mol. Mass.395.579
SMILESCC(C)c1ccc(CCS[C@H]2CC[C@H](N2C(=O)[C@H](C)CS)C(O)=O)cc1